Forums 🙋 Ask Anything

Getting an error when compiling Noetic packages

  • make[2]: *** [CMakeFiles/std_msgs_generate_messages_eus.dir/build.make:276: /opt/ros/noetic/devel_isolated/std_msgs/share/roseus/ros/std_msgs/manifest.l] Error 3

    make[1]: *** [CMakeFiles/Makefile2:411: CMakeFiles/std_msgs_generate_messages_eus.dir/all] Error 2

    make: *** [Makefile:141: all] Error 2

    <== Failed to process package ‘std_msgs’:

    Command ‘[‘/opt/ros/noetic/’, ‘make’, ‘-j1′]’ returned non-zero exit status 2.


    Reproduce this error by running:

    ==> cd /opt/ros/noetic/build_isolated/std_msgs && /opt/ros/noetic/ make -j1


    Can you advise?



  • You must be logged in to reply to this topic.